BDBM34303 3-(2-methylphenyl)-6-oxidanylidene-8-(2,4,5-trimethoxyphenyl)-2,4,7,8-tetrahydropyrido[2,1-b][1,3,5]thiadiazine-9-carbonitrile::3-(2-methylphenyl)-6-oxo-8-(2,4,5-trimethoxyphenyl)-2,4,7,8-tetrahydropyrido[2,1-b][1,3,5]thiadiazine-9-carbonitrile::8-asaryl-6-keto-3-(o-tolyl)-2,4,7,8-tetrahydropyrido[2,1-b][1,3,5]thiadiazine-9-carbonitrile::MLS000080656::SMR000035436::cid_666938
SMILES COc1cc(OC)c(cc1OC)C1CC(=O)N2CN(CSC2=C1C#N)c1ccccc1C
InChI Key InChIKey=INDVQINXTVBZRB-UHFFFAOYSA-N
Data  2 IC50
  Tab Delimited (TSV)   2D SDfile   Computed 3D by Vconf -m prep SDfile
Find this compound or compounds like it in BindingDB:
Activity Spreadsheet -- Enzyme Inhibition Constant Data from BindingDB
Found 2 hits for monomerid = 34303
TargetLarge T antigen(Simian virus 40)
Southern Research Specialized Biocontainment Screening Center
Curated by PubChem BioAssay
LigandPNGBDBM34303(3-(2-methylphenyl)-6-oxidanylidene-8-(2,4,5-trimet...)
Affinity DataIC50:  5.48E+4nM. Assay description: A biochemical assay using the ADP-Hunter methodology, purified TAg, and ATP to identify compounds that inhibit the ATPase activity of Tag Southern Re...
In DepthDetails PCBioAssay
TargetGag-Pol polyprotein(Human immunodeficiency virus type 1 group M subtyp...)
University of Pittsburgh
Curated by PubChem BioAssay
LigandPNGBDBM34303(3-(2-methylphenyl)-6-oxidanylidene-8-(2,4,5-trimet...)
Affinity DataIC50:  4.51E+3nMpH: 8.0 T: 2°C. Assay description: A fluorescence resonance energy transfer assay is developed in 96-well and 384-well microplate formats with robotic manipulation to enable high-throu...
In DepthDetails PCBioAssay